Target
Renin
Ligand
BDBM17950
Substrate
Meas. Tech.
ChEBML_1525651
IC50
2.3±n/a nM
Citation
 Sun, XWen, XChen, YYShi, CGao, CWu, YWang, LJYang, XHSun, H Discovery of highly potent renin inhibitors potentially interacting with the S3' subsite of renin. Eur J Med Chem 103:269-88 (2015)  
Target
Name:
Renin
Synonyms:
Angiotensinogenase RENI_HUMAN
Type:
Enzyme
Mol. Mass.:
45058.99
Organism:
Homo sapiens (Human)
Description:
Residue:
406
  
Inhibitor
Name:
BDBM17950
Synonyms:
(2S,4S,5S,7S)-5-amino-N-(2-carbamoyl-2,2-dimethylethyl)-4-hydroxy-7-{[4-methoxy-3-(3-methoxypropoxy)phenyl]methyl}-8-methyl-2-(propan-2-yl)nonanamide Aliskiren CHEMBL1639 TEKTURNA
Type:
Small organic molecule
Emp. Form.:
C30H53N3O6
Mol. Mass.:
551.7583
SMILES:
COCCCOc1cc(C[C@@H](C[C@H](N)[C@@H](O)C[C@@H](C(C)C)C(=O)NCC(C)(C)C(N)=O)C(C)C)ccc1OC
: