Target
Aurora kinase B
Ligand
BDBM50135125
Substrate
Meas. Tech.
ChEMBL_1545255 (CHEMBL3751005)
IC50
16±n/a nM
Citation
 Vasbinder, MMAlimzhanov, MAugustin, MBebernitz, GBell, KChuaqui, CDeegan, TFerguson, ADGoodwin, KHuszar, DKawatkar, AKawatkar, SRead, JShi, JSteinbacher, SSteuber, HSu, QToader, DWang, HWoessner, RWu, AYe, MZinda, M Identification of azabenzimidazoles as potent JAK1 selective inhibitors. Bioorg Med Chem Lett 26:60-7 (2015)  
Target
Name:
Aurora kinase B
Synonyms:
AIK2 AIM1 ARK2 AURKB_HUMAN Aurora B-INCENP Aurora kinase B (AURKB) STK-1 STK12 Serine/threonine-protein kinase aurora B
Type:
Protein
Mol. Mass.:
39327.72
Organism:
Homo sapiens (Human)
Description:
Q96GD4
Residue:
344
  
Inhibitor
Name:
BDBM50135125
Synonyms:
CHEMBL3747305
Type:
Small organic molecule
Emp. Form.:
C20H24ClN5O2
Mol. Mass.:
401.89
SMILES:
COc1ccc(cc1OC)-c1nc2c(NCC3CCNCC3)c(Cl)cnc2[nH]1
: