Target
Beta-galactosidase
Ligand
BDBM50140060
Substrate
Meas. Tech.
ChEMBL_1550167 (CHEMBL3756508)
Ki
42±n/a nM
Citation
 Fan, QHPickens, JBStriegler, SGervaise, CD Illuminating the binding interactions of galactonoamidines during the inhibition of฿-galactosidase (E. coli). Bioorg Med Chem 24:661-71 (2016)  
Target
Name:
Beta-galactosidase
Synonyms:
BGAL_ECOLX Lactase | lacZ
Type:
PROTEIN
Mol. Mass.:
116943.87
Organism:
Escherichia coli
Description:
ChEMBL_215882
Residue:
1029
  
Inhibitor
Name:
BDBM50140060
Synonyms:
CHEMBL3754250
Type:
Small organic molecule
Emp. Form.:
C15H22N2O4
Mol. Mass.:
294.3462
SMILES:
CO[C@@H]1[C@@H](O)[C@@H](O)[C@@H](CO)N=C1NCc1ccc(C)cc1
: