Target
Carbonic anhydrase 1
Ligand
BDBM13076
Substrate
Meas. Tech.
ChEMBL_1552240 (CHEMBL3761242)
Ki
328±n/a nM
Citation
 Del Prete, SVullo, DDe Luca, VCarginale, VFerraroni, MOsman, SMAlOthman, ZSupuran, CTCapasso, C Sulfonamide inhibition studies of the฿-carbonic anhydrase from the pathogenic bacterium Vibrio cholerae. Bioorg Med Chem 24:1115-20 (2016)  
Target
Name:
Carbonic anhydrase 1
Synonyms:
CA-I CAB Carbonate dehydratase I Carbonic anhydrase 1 (CA I) Carbonic anhydrase 1 (Recombinant CA I) Carbonic anhydrase B Carbonic anhydrase I (CA I) Carbonic anhydrase I (CAI) Carbonic anhydrase isoenzyme I (hCA I) | hCA
Type:
Enzyme
Mol. Mass.:
28873.37
Organism:
Homo sapiens (Human)
Description:
P00915
Residue:
261
  
Inhibitor
Name:
BDBM13076
Synonyms:
6-chloro-1,1-dioxo-3,4-dihydro-2H-1,2,4-benzothiadiazine-7-sulfonamide Dichlothiazide Hydrochlorothiazide JFD00715 cid_3639
Type:
Small organic molecule
Emp. Form.:
C7H8ClN3O4S2
Mol. Mass.:
297.739
SMILES:
NS(=O)(=O)c1cc2c(NCNS2(=O)=O)cc1Cl
: