Target
Type-2 angiotensin II receptor
Ligand
BDBM82258
Substrate
Meas. Tech.
ChEMBL_1555129 (CHEMBL3768051)
IC50
>10000±n/a nM
Citation
 Sallander, JWallinder, CHallberg, AÅqvist, JGutiérrez-de-Terán, H Structural determinants of subtype selectivity and functional activity of angiotensin II receptors. Bioorg Med Chem Lett 26:1355-9 (2016)  
Target
Name:
Type-2 angiotensin II receptor
Synonyms:
AGTR2 AT2 Angiotensin II type 2 (AT-2) receptor Type-2 angiotensin II receptor
Type:
Enzyme Catalytic Domain
Mol. Mass.:
41201.61
Organism:
Homo sapiens (Human)
Description:
Angiotensin II, central 0 0::P50052
Residue:
363
  
Inhibitor
Name:
BDBM82258
Synonyms:
CAS_114798-26-4 NSC_3961
Type:
Small organic molecule
Emp. Form.:
C22H23ClN6O
Mol. Mass.:
422.911
SMILES:
CCCCc1nc(Cl)c(CO)n1Cc1ccc(cc1)-c1ccccc1-c1nnn[nH]1
: