Target
Low-density lipoprotein receptor-related protein 6
Ligand
BDBM50135174
Substrate
Meas. Tech.
ChEMBL_1555558 (CHEMBL3768328)
IC50
6380±n/a nM
Citation
 Thysiadis, SMpousis, SAvramidis, NKatsamakas, SBalomenos, ARemelli, REfthimiopoulos, SSarli, V Discovery of novel phenoxazinone derivatives as DKK1/LRP6 interaction inhibitors: Synthesis, biological evaluation and structure-activity relationships. Bioorg Med Chem 24:1014-22 (2016)  
Target
Name:
Low-density lipoprotein receptor-related protein 6
Synonyms:
LRP-6 LRP6_HUMAN | Low-density lipoprotein receptor-related protein 6
Type:
PROTEIN
Mol. Mass.:
180387.57
Organism:
Homo sapiens (Human)
Description:
ChEMBL_116698
Residue:
1613
  
Inhibitor
Name:
BDBM50135174
Synonyms:
CHEMBL3747431
Type:
Small organic molecule
Emp. Form.:
C15H13ClN2O5
Mol. Mass.:
336.727
SMILES:
Cl.CN(C)c1ccc2nc3c(cc(=O)c(O)c3oc2c1)C(O)=O
: