Target
Glycogen phosphorylase, muscle form
Ligand
BDBM50148915
Substrate
Meas. Tech.
ChEMBL_1557478 (CHEMBL3771809)
Ki
280±n/a nM
Citation
 Bokor, ÉKun, SDocsa, TGergely, PSomsák, L 4(5)-Aryl-2-C-glucopyranosyl-imidazoles as New Nanomolar Glucose Analogue Inhibitors of Glycogen Phosphorylase. ACS Med Chem Lett 6:1215-9 (2015)  
Target
Name:
Glycogen phosphorylase, muscle form
Synonyms:
Glycogen Phosphorylase (PYGM) Glycogen phosphorylase, muscle form PYGM | PYGM_RABIT
Type:
Enzyme
Mol. Mass.:
97296.32
Organism:
Oryctolagus cuniculus (rabbit)
Description:
Phosphorylation of Ser-15 converts phosphorylase B (unphosphorylated) to phosphorylase A.
Residue:
843
  
Inhibitor
Name:
BDBM50148915
Synonyms:
CHEMBL3770514
Type:
Small organic molecule
Emp. Form.:
C15H18N2O5
Mol. Mass.:
306.3138
SMILES:
OC[C@H]1O[C@H]([C@H](O)[C@@H](O)[C@@H]1O)c1nc(c[nH]1)-c1ccccc1
: