Target
Hypoxia-inducible factor 1-alpha inhibitor
Ligand
BDBM50151393
Substrate
Meas. Tech.
ChEMBL_1561035 (CHEMBL3776331)
IC50
473000±n/a nM
Citation
 Korczynska, MLe, DDYounger, NGregori-Puigjané, ETumber, AKrojer, TVelupillai, SGileadi, CNowak, RPIwasa, EPollock, SBOrtiz Torres, IOppermann, UShoichet, BKFujimori, DG Docking and Linking of Fragments To Discover Jumonji Histone Demethylase Inhibitors. J Med Chem 59:1580-98 (2016)  
Target
Name:
Hypoxia-inducible factor 1-alpha inhibitor
Synonyms:
FIH1 HIF1N_HUMAN Hypoxia-inducible factor 1-alpha inhibitor
Type:
Enzyme
Mol. Mass.:
40278.92
Organism:
Homo sapiens (Human)
Description:
Q9NWT6
Residue:
349
  
Inhibitor
Name:
BDBM50151393
Synonyms:
CHEMBL3775867
Type:
Small organic molecule
Emp. Form.:
C17H13N3O5
Mol. Mass.:
339.3022
SMILES:
Cc1cc(no1)C(=O)Nc1ccc(O)c(c1)-c1cc(ccn1)C(O)=O
: