Target
Receptor-interacting serine/threonine-protein kinase 1
Ligand
BDBM50446278
Substrate
Meas. Tech.
ChEMBL_1569456 (CHEMBL3789118)
IC50
50±n/a nM
Citation
 Harris, PAKing, BWBandyopadhyay, DBerger, SBCampobasso, NCapriotti, CACox, JADare, LDong, XFinger, JNGrady, LCHoffman, SJJeong, JUKang, JKasparcova, VLakdawala, ASLehr, RMcNulty, DENagilla, ROuellette, MTPao, CSRendina, ARSchaeffer, MCSummerfield, JDSwift, BATotoritis, RDWard, PZhang, AZhang, DMarquis, RWBertin, JGough, PJ DNA-Encoded Library Screening Identifies Benzo[b][1,4]oxazepin-4-ones as Highly Potent and Monoselective Receptor Interacting Protein 1 Kinase Inhibitors. J Med Chem 59:2163-78 (2016)  
Target
Name:
Receptor-interacting serine/threonine-protein kinase 1
Synonyms:
Cell death protein RIP RIPK1_MOUSE Receptor-interacting serine/threonine-protein kinase 1 Rinp Ripk1 | Serine/threonine-protein kinase RIP
Type:
PROTEIN
Mol. Mass.:
74852.62
Organism:
Mus musculus
Description:
ChEMBL_116773
Residue:
656
  
Inhibitor
Name:
BDBM50446278
Synonyms:
CHEMBL3109202
Type:
Small organic molecule
Emp. Form.:
C23H23N5O2
Mol. Mass.:
401.461
SMILES:
CC(C)(C)c1cc(NC(=O)Nc2ccc(cc2)-c2cccc3c(N)nccc23)no1
: