Target
Receptor-interacting serine/threonine-protein kinase 1
Ligand
BDBM50159512
Substrate
Meas. Tech.
ChEMBL_1569443 (CHEMBL3789105)
IC50
16±n/a nM
Citation
 Harris, PAKing, BWBandyopadhyay, DBerger, SBCampobasso, NCapriotti, CACox, JADare, LDong, XFinger, JNGrady, LCHoffman, SJJeong, JUKang, JKasparcova, VLakdawala, ASLehr, RMcNulty, DENagilla, ROuellette, MTPao, CSRendina, ARSchaeffer, MCSummerfield, JDSwift, BATotoritis, RDWard, PZhang, AZhang, DMarquis, RWBertin, JGough, PJ DNA-Encoded Library Screening Identifies Benzo[b][1,4]oxazepin-4-ones as Highly Potent and Monoselective Receptor Interacting Protein 1 Kinase Inhibitors. J Med Chem 59:2163-78 (2016)  
Target
Name:
Receptor-interacting serine/threonine-protein kinase 1
Synonyms:
Cell death protein RIP RIP-1 RIPK1 Receptor-interacting protein 1
Type:
Enzyme Catalytic Domain
Mol. Mass.:
75926.99
Organism:
Homo sapiens (Human)
Description:
Q13546
Residue:
671
  
Inhibitor
Name:
BDBM50159512
Synonyms:
CHEMBL3786293
Type:
Small organic molecule
Emp. Form.:
C20H17N3O4
Mol. Mass.:
363.3667
SMILES:
O=C(N[C@H]1COc2ccccc2NC1=O)c1cc(Cc2ccccc2)on1
: