Target
Metallo-beta-lactamase type 2
Ligand
BDBM50129062
Substrate
Meas. Tech.
ChEMBL_1567671 (CHEMBL3792099)
Kd
11000±n/a nM
Citation
 Christopeit, TLeiros, HK Fragment-based discovery of inhibitor scaffolds targeting the metallo-ß-lactamases NDM-1 and VIM-2. Bioorg Med Chem Lett 26:1973-7 (2016)  
Target
Name:
Metallo-beta-lactamase type 2
Synonyms:
B2 metallo-beta-lactamase Beta-lactamase NDM-1 Metallo-beta-lactamase NDM-1 Metallo-beta-lactamase type II New Delhi metallo-beta-lactamase-1 | blaNDM-1
Type:
PROTEIN
Mol. Mass.:
28498.15
Organism:
Klebsiella pneumoniae
Description:
ChEMBL_103887
Residue:
270
  
Inhibitor
Name:
BDBM50129062
Synonyms:
CHEBI:43968 Meropenem Merrem iv | SM-7338
Type:
Small organic molecule
Emp. Form.:
C17H25N3O5S
Mol. Mass.:
383.463
SMILES:
[H][C@]1([C@@H](C)O)C(=O)N2C(C(O)=O)=C(S[C@@H]3CN[C@@H](C3)C(=O)N(C)C)[C@H](C)[C@]12[H]
: