Target
Proteasome subunit beta type-5
Ligand
BDBM50163685
Substrate
Meas. Tech.
ChEMBL_1572440 (CHEMBL3796231)
IC50
1.2±n/a nM
Citation
 Lei, MFeng, HWang, CLi, HShi, JWang, JLiu, ZChen, SHu, SZhu, Y 3D-QSAR-aided design, synthesis, in vitro and in vivo evaluation of dipeptidyl boronic acid proteasome inhibitors and mechanism studies. Bioorg Med Chem 24:2576-88 (2016)  
Target
Name:
Proteasome subunit beta type-5
Synonyms:
20S proteasome chymotrypsin-like LMPX PSB5_HUMAN Proteasome Macropain subunit MB1 X
Type:
Protein
Mol. Mass.:
28480.96
Organism:
Homo sapiens (Human)
Description:
Residue:
263
  
Inhibitor
Name:
BDBM50163685
Synonyms:
CHEMBL3793581
Type:
Small organic molecule
Emp. Form.:
C32H49BN2O4
Mol. Mass.:
536.553
SMILES:
[H][C@@]12C[C@@]([H])(C1(C)C)[C@]1(C)OB(OC1C2)[C@H](CC(C)C)NC(=O)[C@H](CC(C)C)NC(=O)c1cccc2CCCCc12
: