Target
5'-nucleotidase
Ligand
BDBM50165148
Substrate
Meas. Tech.
ChEMBL_1572755 (CHEMBL3804264)
Ki
79±n/a nM
Citation
 al-Rashida, MBatool, GSattar, AEjaz, SAKhan, SLecka, JSévigny, JHameed, AIqbal, J 2-Alkoxy-3-(sulfonylarylaminomethylene)-chroman-4-ones as potent and selective inhibitors of ectonucleotidases. Eur J Med Chem 115:484-94 (2016)  
Target
Name:
5'-nucleotidase
Synonyms:
5'-NT 5NTD_HUMAN Ecto-5'-nucleotidase NT5 NTE
Type:
Enzyme
Mol. Mass.:
63371.54
Organism:
Homo sapiens (Human)
Description:
P21589
Residue:
574
  
Inhibitor
Name:
BDBM50165148
Synonyms:
CHEMBL3797640
Type:
Small organic molecule
Emp. Form.:
C17H15ClN2O5S
Mol. Mass.:
394.829
SMILES:
COC1Oc2ccc(Cl)cc2C(=O)\C1=C/Nc1ccc(cc1)S(N)(=O)=O
: