Target
Prostaglandin E2 receptor EP3 subtype
Ligand
BDBM50414549
Substrate
Meas. Tech.
ChEMBL_1575414 (CHEMBL3802311)
Ki
4.4±n/a nM
Citation
 Lee, ECFutatsugi, KArcari, JTBahnck, KCoffey, SBDerksen, DRKalgutkar, ASLoria, PMSharma, R Optimization of amide-based EP3 receptor antagonists. Bioorg Med Chem Lett 26:2670-5 (2016)  
Target
Name:
Prostaglandin E2 receptor EP3 subtype
Synonyms:
PE2R3_HUMAN PGE2-R Prostaglandin E2 receptor Prostaglandin E2 receptor EP3 subtype (EP3) Prostaglandin E2 receptor EP3D subtype (EP3D) | Prostanoid EP3 receptor
Type:
Enzyme
Mol. Mass.:
43335.03
Organism:
Homo sapiens (Human)
Description:
P43115
Residue:
390
  
Inhibitor
Name:
BDBM50414549
Synonyms:
CHEMBL563480
Type:
Small organic molecule
Emp. Form.:
C19H16Cl2N4O2S
Mol. Mass.:
435.327
SMILES:
CCN1CCOc2ccc(cc12)C(=O)Nc1nnc(s1)-c1c(Cl)cccc1Cl
: