Target
Macrophage migration inhibitory factor
Ligand
BDBM50167982
Substrate
Meas. Tech.
ChEMBL_1574572 (CHEMBL3804644)
IC50
110±n/a nM
Citation
 Cisneros, JARobertson, MJValhondo, MJorgensen, WL Irregularities in enzyme assays: The case of macrophage migration inhibitory factor. Bioorg Med Chem Lett 26:2764-2767 (2016)  
Target
Name:
Macrophage migration inhibitory factor
Synonyms:
GIF Glycosylation-inhibiting factor L-dopachrome tautomerase MIF/CD74 (Macrophage migration inhibitory factor and HLA-DR antigens-associated invariant chain) MMIF Macrophage migration inhibitory factor (MIF) | Phenylpyruvate tautomerase
Type:
Enzyme
Mol. Mass.:
12478.18
Organism:
Homo sapiens (Human)
Description:
P14174
Residue:
115
  
Inhibitor
Name:
BDBM50167982
Synonyms:
CHEMBL3797982
Type:
Small organic molecule
Emp. Form.:
C13H10N2O2
Mol. Mass.:
226.2307
SMILES:
Oc1ccc(cc1O)-c1cnc2ccccn12
: