Target
Hexokinase-1
Ligand
BDBM50169015
Substrate
Meas. Tech.
ChEMBL_1577557 (CHEMBL3807033)
IC50
790±n/a nM
Citation
 Lin, HZeng, JXie, RSchulz, MJTedesco, RQu, JErhard, KFMack, JFRaha, KRendina, ARSzewczuk, LMKratz, PMJurewicz, AJCecconie, TMartens, SMcDevitt, PJMartin, JDChen, SBJiang, YNickels, LSchwartz, BJSmallwood, AZhao, BCampobasso, NQian, YBriand, JRominger, CMOleykowski, CHardwicke, MALuengo, JI Discovery of a Novel 2,6-Disubstituted Glucosamine Series of Potent and Selective Hexokinase 2 Inhibitors. ACS Med Chem Lett 7:217-22 (2016)  
Target
Name:
Hexokinase-1
Synonyms:
Brain form hexokinase HK1 Hexokinase type I hexokinase-1 isoform HKI
Type:
PROTEIN
Mol. Mass.:
102488.34
Organism:
Homo sapiens (Human)
Description:
EBI_11382
Residue:
917
  
Inhibitor
Name:
BDBM50169015
Synonyms:
CHEMBL3805460
Type:
Small organic molecule
Emp. Form.:
C19H21NO6
Mol. Mass.:
359.3731
SMILES:
OC[C@H]1OC(O)[C@H](NC(=O)c2cccc(c2)-c2ccccc2)[C@@H](O)[C@@H]1O
: