Target
Casein kinase II subunit alpha
Ligand
BDBM50172246
Substrate
Meas. Tech.
ChEMBL_1579153 (CHEMBL3811873)
IC50
<3.0±n/a nM
Citation
 Dowling, JEAlimzhanov, MBao, LChuaqui, CDenz, CRJenkins, ELarsen, NALyne, PDPontz, TYe, QHoldgate, GASnow, LO'Connell, NFerguson, AD Potent and Selective CK2 Kinase Inhibitors with Effects on Wnt Pathway Signaling in Vivo. ACS Med Chem Lett 7:300-5 (2016)  
Target
Name:
Casein kinase II subunit alpha
Synonyms:
CK II CK2- alpha CSK21_HUMAN Casein kinase 2 Casein kinase II alpha/beta Casein kinase II subunit alpha (CK2A1) Casein kinase II subunit alpha (CK2a V66A) Casein kinase II subunit alpha (CK2a)
Type:
Enzyme
Mol. Mass.:
45151.12
Organism:
Homo sapiens (Human)
Description:
P68400
Residue:
391
  
Inhibitor
Name:
BDBM50172246
Synonyms:
CHEMBL3103191
Type:
Small organic molecule
Emp. Form.:
C23H29N9O
Mol. Mass.:
447.5361
SMILES:
CN(C)CCN(C)c1ccc(Nc2cc(NC3CC3)n3ncc(C#N)c3n2)cc1NC(C)=O
: