Target
Apelin receptor
Ligand
BDBM50172390
Substrate
Meas. Tech.
ChEMBL_1579548 (CHEMBL3810894)
Ki
0.530000±n/a nM
Citation
 Murza, ASainsily, XCoquerel, DCôté, JMarx, PBesserer-Offroy, ÉLongpré, JMLainé, JReversade, BSalvail, DLeduc, RDumaine, RLesur, OAuger-Messier, MSarret, PMarsault, É Discovery and Structure-Activity Relationship of a Bioactive Fragment of ELABELA that Modulates Vascular and Cardiac Functions. J Med Chem 59:2962-72 (2016)  
Target
Name:
Apelin receptor
Synonyms:
AGTRL1 APJ_HUMAN Angiotensin receptor-like 1 Apelin receptor (APJ) G-protein coupled receptor HG11
Type:
Enzyme Catalytic Domain
Mol. Mass.:
42664.06
Organism:
Homo sapiens (Human)
Description:
P35414
Residue:
380
  
Inhibitor
Name:
BDBM50172390
Synonyms:
CHEMBL3809537
Type:
Small organic molecule
Emp. Form.:
C73H119N25O16S2
Mol. Mass.:
1667.014
SMILES:
CSCCC(NC(=O)C(CS)NC(=O)C(CCCNC(N)=N)NC(=O)C(CCCNC(N)=N)NC(=O)C(C)N)C(=O)N1CCCC1C(=O)NC(CC(C)C)C(=O)NC(Cc1cnc[nH]1)C(=O)NC(CO)C(=O)NC(CCCNC(N)=N)C(=O)NC(C(C)C)C(=O)N1CCCC1C(=O)NC(Cc1ccccc1)C(=O)N1CCCC1C(O)=O
: