Target
Alpha-1A adrenergic receptor
Ligand
BDBM50173104
Substrate
Meas. Tech.
ChEMBL_1579180 (CHEMBL3812083)
IC50
8.0±n/a nM
Citation
 Zhao, FLi, JChen, YTian, YWu, CXie, YZhou, YWang, JXie, XLiu, H Design, Synthesis, and Biological Evaluation of Indoline and Indole Derivatives as Potent and Selectivea1A-Adrenoceptor Antagonists. J Med Chem 59:3826-39 (2016)  
Target
Name:
Alpha-1A adrenergic receptor
Synonyms:
ADA1A_HUMAN ADRA1C Alpha 1A-adrenoceptor Alpha adrenergic receptor 1a Alpha-adrenergic receptor 1c adrenergic Alpha1 | adrenergic Alpha1C
Type:
Cell-surface receptors
Mol. Mass.:
51511.67
Organism:
Homo sapiens (Human)
Description:
P35348
Residue:
466
  
Inhibitor
Name:
BDBM50173104
Synonyms:
CHEMBL3809676
Type:
Small organic molecule
Emp. Form.:
C24H30FN3O4
Mol. Mass.:
443.5111
SMILES:
COc1cc(F)ccc1OCCNC(C)Cc1cc(C(N)=O)c2n(CCCO)ccc2c1
: