Target
Tyrosyl-DNA phosphodiesterase 1
Ligand
BDBM50172711
Substrate
Meas. Tech.
ChEMBL_1579212 (CHEMBL3812292)
IC50
>111000±n/a nM
Citation
 Beck, DEReddy, PVLv, WAbdelmalak, MTender, GSLopez, SAgama, KMarchand, CPommier, YCushman, M Investigation of the Structure-Activity Relationships of Aza-A-Ring Indenoisoquinoline Topoisomerase I Poisons. J Med Chem 59:3840-53 (2016)  
Target
Name:
Tyrosyl-DNA phosphodiesterase 1
Synonyms:
TDP1 Tyrosyl-DNA phosphodiesterase 1 | Tyrosyl-DNA phosphodiesterase 1 (TDP1)
Type:
Enzyme
Mol. Mass.:
68430.66
Organism:
Homo sapiens (Human)
Description:
Q9NUW8
Residue:
608
  
Inhibitor
Name:
BDBM50172711
Synonyms:
CHEMBL3808575
Type:
Small organic molecule
Emp. Form.:
C22H21N3O3
Mol. Mass.:
375.4204
SMILES:
O=C1c2ccccc2-c2c1c1cccnc1c(=O)n2CCCN1CCOCC1
: