Target
Acyl-protein thioesterase 1
Ligand
BDBM50228403
Substrate
Meas. Tech.
ChEMBL_1581787 (CHEMBL3816313)
IC50
71±n/a nM
Citation
 Wu, WLHao, JDomalski, MBurnett, DAPissarnitski, DZhao, ZStamford, AScapin, GGao, YDSoriano, AKelly, TMYao, ZPowles, MAChen, SMei, HHwa, J Discovery of Novel Tricyclic Heterocycles as Potent and Selective DPP-4 Inhibitors for the Treatment of Type 2 Diabetes. ACS Med Chem Lett 7:498-501 (2016)  
Target
Name:
Acyl-protein thioesterase 1
Synonyms:
Acyl-protein thioesterase 1/2 LYPA1_RAT Lysosomal phospholipase A1
Type:
PROTEIN
Mol. Mass.:
24708.49
Organism:
Rattus norvegicus
Description:
ChEMBL_12731
Residue:
230
  
Inhibitor
Name:
BDBM50228403
Synonyms:
(R)-8-(3-aminopiperidin-1-yl)-7-(but-2-ynyl)-3-methyl-1-((4-methylquinazolin-2-yl)methyl)-1H-purine-2,6(3H,7H)-dione CHEMBL237500 US10202383, Example 2(142) US9255098, Linagliptin US9556175, 2(142)
Type:
Small organic molecule
Emp. Form.:
C25H28N8O2
Mol. Mass.:
472.5422
SMILES:
CC#CCn1c(nc2n(C)c(=O)n(Cc3nc(C)c4ccccc4n3)c(=O)c12)N1CCC[C@@H](N)C1
: