Target
Tyrosyl-DNA phosphodiesterase 1
Ligand
BDBM50179184
Substrate
Meas. Tech.
ChEMBL_1582565 (CHEMBL3816827)
IC50
>111000±n/a nM
Citation
 Kossmann, BRAbdelmalak, MLopez, STender, GYan, CPommier, YMarchand, CIvanov, I Discovery of selective inhibitors of tyrosyl-DNA phosphodiesterase 2 by targeting the enzyme DNA-binding cleft. Bioorg Med Chem Lett 26:3232-3236 (2016)  
Target
Name:
Tyrosyl-DNA phosphodiesterase 1
Synonyms:
TDP1 Tyrosyl-DNA phosphodiesterase 1 | Tyrosyl-DNA phosphodiesterase 1 (TDP1)
Type:
Enzyme
Mol. Mass.:
68430.66
Organism:
Homo sapiens (Human)
Description:
Q9NUW8
Residue:
608
  
Inhibitor
Name:
BDBM50179184
Synonyms:
CHEMBL264425
Type:
Small organic molecule
Emp. Form.:
C20H20N2O6S2
Mol. Mass.:
448.513
SMILES:
OC(=O)C(CSSCC(NC(=O)c1ccccc1)C(O)=O)NC(=O)c1ccccc1
: