Target
Alpha-2A adrenergic receptor
Ligand
BDBM50029050
Substrate
Meas. Tech.
ChEMBL_1583766 (CHEMBL3815853)
Ki
160±n/a nM
Citation
 Vucicevic, JSrdic-Rajic, TPieroni, MLaurila, JMPerovic, VTassini, SAzzali, ECostantino, GGlisic, SAgbaba, DScheinin, MNikolic, KRadi, MVeljkovic, N A combined ligand- and structure-based approach for the identification of rilmenidine-derived compounds which synergize the antitumor effects of doxorubicin. Bioorg Med Chem 24:3174-83 (2016)  
Target
Name:
Alpha-2A adrenergic receptor
Synonyms:
ADA2A_HUMAN ADRA2R Adrenergic alpha2A Alpha-2 adrenergic receptor subtype C10 Alpha-2A adrenoreceptor alpha-2A adrenergic receptor [Homo sapiens]
Type:
Enzyme
Mol. Mass.:
48979.91
Organism:
Homo sapiens (Human)
Description:
P08913
Residue:
450
  
Inhibitor
Name:
BDBM50029050
Synonyms:
(-)-(R)-epinephrine (-)-adrenaline (R)-adrenaline Adrenalin EPINEPHRINE levoepinephrine
Type:
Small organic molecule
Emp. Form.:
C9H13NO3
Mol. Mass.:
183.2044
SMILES:
CNC[C@H](O)c1ccc(O)c(O)c1
: