Target
2-amino-4-hydroxy-6-hydroxymethyldihydropteridine pyrophosphokinase
Ligand
BDBM50181536
Substrate
Meas. Tech.
ChEMBL_1585632 (CHEMBL3820451)
Kd
5200±n/a nM
Citation
 Dennis, MLPitcher, NPLee, MDDeBono, AJWang, ZCHarjani, JRRahmani, RCleary, BPeat, TSBaell, JBSwarbrick, JD Structural Basis for the Selective Binding of Inhibitors to 6-Hydroxymethyl-7,8-dihydropterin Pyrophosphokinase from Staphylococcus aureus and Escherichia coli. J Med Chem 59:5248-63 (2016)  
Target
Name:
2-amino-4-hydroxy-6-hydroxymethyldihydropteridine pyrophosphokinase
Synonyms:
2-amino-4-hydroxy-6-hydroxymethyldihydropteridine pyrophosphokinase 7,8-dihydro-6-hydroxymethylpterin-pyrophosphokinase HPPK_ECOLI PPPK | folK
Type:
PROTEIN
Mol. Mass.:
18075.55
Organism:
Escherichia coli (strain K12)
Description:
ChEMBL_108237
Residue:
159
  
Inhibitor
Name:
BDBM50181536
Synonyms:
CHEMBL3818636
Type:
Small organic molecule
Emp. Form.:
C13H10F3N5O2S
Mol. Mass.:
357.311
SMILES:
Nc1nc2[nH]c(SCc3ccc(OC(F)(F)F)cc3)nc2c(=O)[nH]1
: