Target
Bromodomain-containing protein 7
Ligand
BDBM50183452
Substrate
Meas. Tech.
ChEMBL_1586793 (CHEMBL3826478)
IC50
3283±n/a nM
Citation
 Martin, LJKoegl, MBader, GCockcroft, XLFedorov, OFiegen, DGerstberger, THofmann, MHHohmann, AFKessler, DKnapp, SKnesl, PKornigg, SMüller, SNar, HRogers, CRumpel, KSchaaf, OSteurer, STallant, CVakoc, CRZeeb, MZoephel, APearson, MBoehmelt, GMcConnell, D Structure-Based Design of an in Vivo Active Selective BRD9 Inhibitor. J Med Chem 59:4462-75 (2016)  
Target
Name:
Bromodomain-containing protein 7
Synonyms:
75 kDa bromodomain protein BRD7 CELTIX1 | Protein CELTIX-1
Type:
PROTEIN
Mol. Mass.:
74135.71
Organism:
Homo sapiens (Human)
Description:
ChEMBL_107970
Residue:
651
  
Inhibitor
Name:
BDBM50183452
Synonyms:
CHEMBL3824351
Type:
Small organic molecule
Emp. Form.:
C19H26N2O3
Mol. Mass.:
330.4213
SMILES:
COc1cc(c(OC)cc1CN(C)C)-c1cc(C)c(=O)n(C)c1C
: