Target
Activin receptor type-2B
Ligand
BDBM50183448
Substrate
Meas. Tech.
ChEMBL_1586819 (CHEMBL3826651)
IC50
>20000±n/a nM
Citation
 Martin, LJKoegl, MBader, GCockcroft, XLFedorov, OFiegen, DGerstberger, THofmann, MHHohmann, AFKessler, DKnapp, SKnesl, PKornigg, SMüller, SNar, HRogers, CRumpel, KSchaaf, OSteurer, STallant, CVakoc, CRZeeb, MZoephel, APearson, MBoehmelt, GMcConnell, D Structure-Based Design of an in Vivo Active Selective BRD9 Inhibitor. J Med Chem 59:4462-75 (2016)  
Target
Name:
Activin receptor type-2B
Synonyms:
ACVR2B Activin receptor type-2B
Type:
Enzyme Catalytic Domain
Mol. Mass.:
57713.76
Organism:
Homo sapiens (Human)
Description:
gi_116734708
Residue:
512
  
Inhibitor
Name:
BDBM50183448
Synonyms:
CHEMBL3823478 | US11773085, Compound B2
Type:
Small organic molecule
Emp. Form.:
C20H23N3O3
Mol. Mass.:
353.4149
SMILES:
COc1cc(cc(OC)c1CN(C)C)-c1cn(C)c(=O)c2cnccc12
: