Target
3-phosphoinositide-dependent protein kinase 1
Ligand
BDBM50341243
Substrate
Meas. Tech.
ChEMBL_1588500 (CHEMBL3826783)
IC50
2.5±n/a nM
Citation
 Sestito, SDaniele, SNesi, GZappelli, EDi Maio, DMarinelli, LDigiacomo, MLapucci, AMartini, CNovellino, ERapposelli, S Locking PDK1 in DFG-out conformation through 2-oxo-indole containing molecules: Another tools to fight glioblastoma. Eur J Med Chem 118:47-63 (2016)  
Target
Name:
3-phosphoinositide-dependent protein kinase 1
Synonyms:
3-Phosphoinositide-Dependent Protein Kinase 1 (PDK1) 3-phosphoinositide-dependent protein kinase 1 3-phosphoinositide-dependent protein kinase 1 (PDK-1) Isoform 2 of 3-phosphoinositide-dependent protein kinase 1 PDPK1 Phosphoinositide-dependent protein kinase 1 (PDK1) hPDK1
Type:
Enzyme
Mol. Mass.:
63157.65
Organism:
Homo sapiens (Human)
Description:
O15530
Residue:
556
  
Inhibitor
Name:
BDBM50341243
Synonyms:
(3S,6R)-1-[6-(3-Amino-1H-indazol-6-yl)-2-(methylamino)-4-pyrimidinyl]-N-cyclohexyl-6-methyl-3-piperidinecarboxamide | CHEMBL1765740
Type:
Small organic molecule
Emp. Form.:
C25H34N8O
Mol. Mass.:
462.5905
SMILES:
CNc1nc(cc(n1)-c1ccc2c(N)n[nH]c2c1)N1C[C@H](CC[C@H]1C)C(=O)NC1CCCCC1
: