Target
Acetylcholinesterase
Ligand
BDBM8960
Substrate
Meas. Tech.
ChEMBL_1587903 (CHEMBL3826564)
IC50
120±n/a nM
Citation
 Wang, JWang, ZMLi, XMLi, FWu, JJKong, LYWang, XB Synthesis and evaluation of multi-target-directed ligands for the treatment of Alzheimer's disease based on the fusion of donepezil and melatonin. Bioorg Med Chem 24:4324-4338 (2016)  
Target
Name:
Acetylcholinesterase
Synonyms:
ACES_HUMAN Acetylcholinesterase (AChE) | Acetylcholinesterase (human AChE)
Type:
Enzyme
Mol. Mass.:
67792.70
Organism:
Homo sapiens (Human)
Description:
P22303
Residue:
614
  
Inhibitor
Name:
BDBM8960
Synonyms:
(+/-)-2-[(1-benzylpiperidin-4-yl)methyl]-5,6-dimethoxy-indan-1-one Aricept CHEMBL1678 CHEMBL502 Donepezil E2020 US9346818, DPH US9663465, Donepezil
Type:
Small organic molecule
Emp. Form.:
C24H29NO3
Mol. Mass.:
379.492
SMILES:
COc1cc2CC(CC3CCN(Cc4ccccc4)CC3)C(=O)c2cc1OC
: