Target
Fibroblast growth factor receptor 1
Ligand
BDBM50189872
Substrate
Meas. Tech.
ChEMBL_1590266 (CHEMBL3830044)
IC50
0.300000±n/a nM
Citation
 Yan, WWang, XDai, YZhao, BYang, XFan, JGao, YMeng, FWang, YLuo, CAi, JGeng, MDuan, W Discovery of 3-(5'-Substituted)-Benzimidazole-5-(1-(3,5-dichloropyridin-4-yl)ethoxy)-1H-indazoles as Potent Fibroblast Growth Factor Receptor Inhibitors: Design, Synthesis, and Biological Evaluation. J Med Chem 59:6690-708 (2016)  
Target
Name:
Fibroblast growth factor receptor 1
Synonyms:
BFGFR Basic fibroblast growth factor receptor 1 (FGFR1) CEK FGFR-1 FGFR-1, (FL) FGFR1_HUMAN FLT2 Fibroblast growth factor receptor 1 (FGFR-1) Fms-like tyrosine kinase 2 N-sam bFGF-R | c-fgr
Type:
Receptor
Mol. Mass.:
91861.70
Organism:
Homo sapiens (Human)
Description:
P11362
Residue:
822
  
Inhibitor
Name:
BDBM50189872
Synonyms:
CHEMBL3827492
Type:
Small organic molecule
Emp. Form.:
C25H25Cl2N7O
Mol. Mass.:
510.418
SMILES:
CC(Oc1ccc2[nH]nc(-c3nc4cc(NCCN(C)C)ccc4[nH]3)c2c1)c1c(Cl)cncc1Cl
: