Target
DNA polymerase kappa
Ligand
BDBM50318907
Substrate
Meas. Tech.
ChEMBL_1612841 (CHEMBL3854641)
IC50
5600±n/a nM
Citation
 Korzhnev, DMHadden, MK Targeting the Translesion Synthesis Pathway for the Development of Anti-Cancer Chemotherapeutics. J Med Chem 59:9321-9336 (2016)  
Target
Name:
DNA polymerase kappa
Synonyms:
DINB1 POLK_HUMAN
Type:
PROTEIN
Mol. Mass.:
98825.18
Organism:
Homo sapiens (Human)
Description:
ChEMBL_1297316
Residue:
870
  
Inhibitor
Name:
BDBM50318907
Synonyms:
2-Ethoxy-3-[2'-(1H-tetrazol-5-yl)-biphenyl-4-ylmethyl]-3H-benzoimidazole-4-carboxylic acid 1-cyclohexyloxycarbonyloxy-ethyl ester Amias Blopress CHEMBL1014 Kenzen TCV-116 | candesartancilexetil
Type:
Small organic molecule
Emp. Form.:
C33H34N6O6
Mol. Mass.:
610.6597
SMILES:
CCOc1nc2cccc(C(=O)OC(C)OC(=O)OC3CCCCC3)c2n1Cc1ccc(cc1)-c1ccccc1-c1nnn[nH]1
: