Target
cGMP-inhibited 3',5'-cyclic phosphodiesterase 3A
Ligand
BDBM237920
Substrate
Meas. Tech.
ChEMBL_1612931 (CHEMBL3854731)
IC50
14000±n/a nM
Citation
 Cameron, KOKung, DWKalgutkar, ASKurumbail, RGMiller, RSalatto, CTWard, JWithka, JMBhattacharya, SKBoehm, MBorzilleri, KABrown, JACalabrese, MCaspers, NLCokorinos, EConn, ELDowling, MSEdmonds, DJEng, HFernando, DPFrisbie, RHepworth, DLandro, JMao, YRajamohan, FReyes, ARRose, CRRyder, TShavnya, ASmith, ACTu, MWolford, ACXiao, J Discovery and Preclinical Characterization of 6-Chloro-5-[4-(1-hydroxycyclobutyl)phenyl]-1H-indole-3-carboxylic Acid (PF-06409577), a Direct Activator of Adenosine Monophosphate-activated Protein Kinase (AMPK), for the Potential Treatment of Diabetic Nephropathy. J Med Chem 59:8068-81 (2016)  
Target
Name:
cGMP-inhibited 3',5'-cyclic phosphodiesterase 3A
Synonyms:
3',5'-cyclic phosphodiesterase Cyclic GMP-inhibited phosphodiesterase A PDE3A_HUMAN Phosphodiesterase 3 (PDE3) Phosphodiesterase 3A Phosphodiesterase 3A (PDE3A1) cGMP-inhibited 3',5'-cyclic phosphodiesterase A | cGMP-inhibited 3,5-cyclic phosphodiesterase A
Type:
Enzyme
Mol. Mass.:
124966.46
Organism:
Homo sapiens (Human)
Description:
Q14432
Residue:
1141
  
Inhibitor
Name:
BDBM237920
Synonyms:
US9394285, 1
Type:
Small organic molecule
Emp. Form.:
C19H16ClNO3
Mol. Mass.:
341.788
SMILES:
OC(=O)c1c[nH]c2cc(Cl)c(cc12)-c1ccc(cc1)C1(O)CCC1
: