Target
Sodium-dependent serotonin transporter
Ligand
BDBM50193394
Substrate
Meas. Tech.
ChEMBL_1615834 (CHEMBL3857903)
IC50
2000±n/a nM
Citation
 Gao, WHou, WZZhao, JXu, FLi, LXu, FSun, HXing, JGPeng, YWang, XLJi, TFGu, ZY Polycyclic Polyprenylated Acylphloroglucinol Congeners from Hypericum scabrum. J Nat Prod 79:1538-47 (2016)  
Target
Name:
Sodium-dependent serotonin transporter
Synonyms:
5-HT Transporter 5HTT SC6A4_HUMAN SLC6A4 Serotonin transporter (5HTT) Sodium-dependent serotonin transporter (SERT) | Solute carrier family 6 member 4
Type:
Multi-pass membrane protein
Mol. Mass.:
70322.51
Organism:
Homo sapiens (Human)
Description:
P31645
Residue:
630
  
Inhibitor
Name:
BDBM50193394
Synonyms:
CHEMBL536352
Type:
Small organic molecule
Emp. Form.:
C36H54O4
Mol. Mass.:
550.8116
SMILES:
[#6]-[#6]-[#6](-[#6])-[#6](=O)[C@@]12[#6](-[#8])=[#6](-[#6]\[#6]=[#6](\[#6])-[#6])-[#6](=O)[C@@]([#6]\[#6]=[#6](\[#6])-[#6])([#6]-[#6@H](-[#6]\[#6]=[#6](/[#6])-[#6])[C@@]1([#6])[#6]-[#6]\[#6]=[#6](\[#6])-[#6])[#6]2=O
: