Target
Protein arginine N-methyltransferase 6
Ligand
BDBM50194730
Substrate
Meas. Tech.
ChEMBL_1616974 (CHEMBL3859043)
IC50
25±n/a nM
Citation
 Shen, YSzewczyk, MMEram, MSSmil, DKaniskan, HÜde Freitas, RFSenisterra, GLi, FSchapira, MBrown, PJArrowsmith, CHBarsyte-Lovejoy, DLiu, JVedadi, MJin, J Discovery of a Potent, Selective, and Cell-Active Dual Inhibitor of Protein Arginine Methyltransferase 4 and Protein Arginine Methyltransferase 6. J Med Chem 59:9124-9139 (2016)  
Target
Name:
Protein arginine N-methyltransferase 6
Synonyms:
ANM6_HUMAN Heterogeneous nuclear ribonucleoprotein methyltransferase-like protein 6 PRMT6 | Protein arginine methyltransferase 6 (PRMT6)
Type:
Protein
Mol. Mass.:
41928.48
Organism:
Homo sapiens (Human)
Description:
Residue:
375
  
Inhibitor
Name:
BDBM50194730
Synonyms:
CHEMBL3906680
Type:
Small organic molecule
Emp. Form.:
C15H23BrN2O
Mol. Mass.:
327.26
SMILES:
CNCCN1CCC(CC1)OCc1ccccc1Br
: