Target
Protein arginine N-methyltransferase 6
Ligand
BDBM50194785
Substrate
Meas. Tech.
ChEMBL_1616974 (CHEMBL3859043)
IC50
25±n/a nM
Citation
 Shen, YSzewczyk, MMEram, MSSmil, DKaniskan, HÜde Freitas, RFSenisterra, GLi, FSchapira, MBrown, PJArrowsmith, CHBarsyte-Lovejoy, DLiu, JVedadi, MJin, J Discovery of a Potent, Selective, and Cell-Active Dual Inhibitor of Protein Arginine Methyltransferase 4 and Protein Arginine Methyltransferase 6. J Med Chem 59:9124-9139 (2016)  
Target
Name:
Protein arginine N-methyltransferase 6
Synonyms:
ANM6_HUMAN Heterogeneous nuclear ribonucleoprotein methyltransferase-like protein 6 PRMT6 | Protein arginine methyltransferase 6 (PRMT6)
Type:
Protein
Mol. Mass.:
41928.48
Organism:
Homo sapiens (Human)
Description:
Residue:
375
  
Inhibitor
Name:
BDBM50194785
Synonyms:
CHEMBL3956007
Type:
Small organic molecule
Emp. Form.:
C20H30N4O
Mol. Mass.:
342.4784
SMILES:
CNCCN1CCC(CC1)OCc1ccc(cc1)-n1nc(C)cc1C
: