Target
Major pollen allergen Bet v 1-A
Ligand
BDBM12590
Substrate
Meas. Tech.
ChEMBL_1621640 (CHEMBL3863923)
Kd
140000±n/a nM
Citation
 Moschen, TGrutsch, SJuen, MAWunderlich, CHKreutz, CTollinger, M Measurement of Ligand-Target Residence Times by J Med Chem 59:10788-10793 (2016)  
Target
Name:
Major pollen allergen Bet v 1-A
Synonyms:
Allergen Bet v I-A BETVI BEV1A_BETPN | Major pollen allergen Bet v 1-A
Type:
PROTEIN
Mol. Mass.:
17567.57
Organism:
Betula pendula
Description:
ChEMBL_116959
Residue:
160
  
Inhibitor
Name:
BDBM12590
Synonyms:
(6-aminoacridin-3-yl)amine Proflavin SMR002533346 cid_7099
Type:
Small organic molecule
Emp. Form.:
C13H11N3
Mol. Mass.:
209.2465
SMILES:
Nc1ccc2cc3ccc(N)cc3nc2c1
: