Target
Adenosine receptor A1
Ligand
BDBM50199620
Substrate
Meas. Tech.
ChEMBL_1621693 (CHEMBL3863976)
IC50
2.0±n/a nM
Citation
 Grŕcia, JBuil, MACastro, JEichhorn, PFerrer, MGavaldŕ, AHernández, BSegarra, VLehner, MDMoreno, IPagčs, LRoberts, RSSerrat, JSevilla, STaltavull, JAndrés, MCabedo, JVilella, DCalama, ECarcasona, CMiralpeix, M Biphenyl Pyridazinone Derivatives as Inhaled PDE4 Inhibitors: Structural Biology and Structure-Activity Relationships. J Med Chem 59:10479-10497 (2016)  
Target
Name:
Adenosine receptor A1
Synonyms:
A1 adenosine receptor (hA1) AA1R_HUMAN ADORA1 Adenosine A1-receptor Adenosine receptor A1 (hA1) | Adenosine transporter (AdT)
Type:
G Protein-Coupled Receptor (GPCR)
Mol. Mass.:
36520.92
Organism:
Homo sapiens (Human)
Description:
P30542
Residue:
326
  
Inhibitor
Name:
BDBM50199620
Synonyms:
CHEMBL3916846
Type:
Small organic molecule
Emp. Form.:
C31H32Cl2N8O3
Mol. Mass.:
635.544
SMILES:
CCn1nc(cc(NC(=O)Nc2c(Cl)cncc2Cl)c1=O)-c1cccc(c1)-c1cccc(c1)C(=O)NCCN1CCNCC1
: