Target
NAD(P)H dehydrogenase [quinone] 1
Ligand
BDBM50201797
Substrate
Meas. Tech.
ChEMBL_1623557 (CHEMBL3865969)
IC50
1800±n/a nM
Citation
 da Cruz, EHGSilvers, MAJardim, GAMResende, JMCavalcanti, BCBomfim, ISPessoa, Cde Simone, CABotteselle, GVBraga, ALNair, DKNamboothiri, INNBoothman, DAda Silva Júnior, EN Synthesis and antitumor activity of selenium-containing quinone-based triazoles possessing two redox centres, and their mechanistic insights. Eur J Med Chem 122:1-16 (2016)  
Target
Name:
NAD(P)H dehydrogenase [quinone] 1
Synonyms:
Azoreductase DT-diaphorase NAD(P)H:quinone oxidoreductase 1 NQO1 Phylloquinone reductase Quinone Reductase 1 | Quinone reductase 1)
Type:
Homodimer
Mol. Mass.:
30874.82
Organism:
Homo sapiens (Human)
Description:
Residue:
274
  
Inhibitor
Name:
BDBM50201797
Synonyms:
CHEMBL516585
Type:
Small organic molecule
Emp. Form.:
C20H16N2O5
Mol. Mass.:
364.3514
SMILES:
CC1(C)OC2=C(C1Nc1ccc(cc1)[N+]([O-])=O)C(=O)C(=O)c1ccccc21
: