Target
Cytochrome P450 2C9
Ligand
BDBM50438976
Substrate
Meas. Tech.
ChEMBL_1624779 (CHEMBL3867191)
IC50
50±n/a nM
Citation
 Zak, MYuen, PWLiu, XPatel, SSampath, DOeh, JLiederer, BMWang, WO'Brien, TXiao, YSkelton, NHua, RSodhi, JWang, YZhang, LZhao, GZheng, XHo, YCBair, KWDragovich, PS Minimizing CYP2C9 Inhibition of Exposed-Pyridine NAMPT (Nicotinamide Phosphoribosyltransferase) Inhibitors. J Med Chem 59:8345-68 (2016)  
Target
Name:
Cytochrome P450 2C9
Synonyms:
(R)-limonene 6-monooxygenase CP2C9_HUMAN CYP2C9 Cytochrome P450 2C9 (CYP2C9 ) P-450MP P450 PB-1 | S-mephenytoin 4-hydroxylase
Type:
Enzyme
Mol. Mass.:
55636.33
Organism:
Homo sapiens (Human)
Description:
P11712
Residue:
490
  
Inhibitor
Name:
BDBM50438976
Synonyms:
CHEMBL2419504
Type:
Small organic molecule
Emp. Form.:
C21H16N2O4S
Mol. Mass.:
392.428
SMILES:
O=C(NCc1ccc(cc1)S(=O)(=O)c1ccccc1)c1cc2ccncc2o1
: