Target
Steroid 17-alpha-hydroxylase/17,20 lyase
Ligand
BDBM50203342
Substrate
Meas. Tech.
ChEMBL_1625603 (CHEMBL3868072)
IC50
9.0±n/a nM
Citation
 Blass, BEIyer, PAbou-Gharbia, MChilders, WEGordon, JCRamanjulu, MMorton, GArumugam, PBoruwa, JEllingboe, JMitra, SNimmareddy, RRPaliwal, SRajasekhar, JShivakumar, SSrivastava, PTangirala, RSVenkataramanaiah, KYanamandra, M Design, synthesis, and evaluation of (2S,4R)-Ketoconazole sulfonamide analogs as potential treatments for Metabolic Syndrome. Bioorg Med Chem Lett 26:5825-5829 (2016)  
Target
Name:
Steroid 17-alpha-hydroxylase/17,20 lyase
Synonyms:
CP17A_HUMAN CYP17A1 Cytochrome P450 17A1 Cytochrome P450 C17 (CYP17) Cytochrome P450-C17 P450-C17 Steroid 17-alpha-Monooxygenase (CYP17) Steroid 17-alpha-monooxygenase | cytochrome P450 monooxygenase 17 alpha hydroxylase/17,20-lyase (CYP17)
Type:
Enzyme
Mol. Mass.:
57382.42
Organism:
Homo sapiens (Human)
Description:
E.coli expressing human CYP17
Residue:
508
  
Inhibitor
Name:
BDBM50203342
Synonyms:
CHEMBL3952032
Type:
Small organic molecule
Emp. Form.:
C26H27Cl2N5O5S
Mol. Mass.:
592.494
SMILES:
Clc1ccc(c(Cl)c1)[C@]1(Cn2ccnc2)OC[C@@H](COc2ccc(cc2)N2CCN(CC2)S(=O)(=O)CC#N)O1
: