Target
Prostaglandin G/H synthase 2
Ligand
BDBM50074922
Substrate
Meas. Tech.
ChEMBL_1627356 (CHEMBL3869877)
IC50
1995±n/a nM
Citation
 Swiatek, PStrzelecka, MUrniaz, RGebczak, KGebarowski, TGasiorowski, KMalinka, W Synthesis, COX-1/2 inhibition activities and molecular docking study of isothiazolopyridine derivatives. Bioorg Med Chem 25:316-326 (2017)  
Target
Name:
Prostaglandin G/H synthase 2
Synonyms:
COX2 Cyclooxygenase 2 (COX-2) Cyclooxygenase-2 (COX-2 AA) Cyclooxygenase-2 (COX-2) PGH2_HUMAN PHS II Prostaglandin E synthase/G/H synthase 2 Prostaglandin-endoperoxide synthase 2
Type:
Enzyme
Mol. Mass.:
69003.89
Organism:
Homo sapiens (Human)
Description:
Recombinant Cox-2 provided by Cayman (Cayman Chemical Co.,Ann Arbor, MI).
Residue:
604
  
Inhibitor
Name:
BDBM50074922
Synonyms:
(+-)-2-fluoro-alpha-methyl-4-biphenylacetic acid 2-(2-fluorobiphenyl-4-yl)propanoic acid 3-fluoro-4-phenylhydratropic acid CHEMBL563 US9630914, Compound A
Type:
Small organic molecule
Emp. Form.:
C15H13FO2
Mol. Mass.:
244.2609
SMILES:
CC(C(O)=O)c1ccc(c(F)c1)-c1ccccc1
: