Target
Casein kinase I delta/epsilon
Ligand
BDBM100152
Substrate
Meas. Tech.
ChEMBL_1627839 (CHEMBL3870424)
IC50
1500±n/a nM
Citation
 Lawson, MRodrigo, JBaratte, BRobert, TDelehouz, CLozach, ORuchaud, SBach, SBrion, JDAlami, MHamze, A Synthesis, biological evaluation and molecular modeling studies of imidazo[1,2-a]pyridines derivatives as protein kinase inhibitors. Eur J Med Chem 123:105-114 (2016)  
Target
Name:
Casein kinase I delta/epsilon
Synonyms:
Casein kinase I isoform delta/epsilon
Type:
Mol. Mass.:
Description:
ASSAY_ID of ChEMBL is 2149257
Components:
This complex has 2 components.
Component 1
Name:
Casein kinase I isoform delta
Synonyms:
CKI-delta CSNK1D Casein kinase I delta Casein kinase I isoform delta (CK1D) KC1D_HUMAN | casein kinases 1 delta (CK1 delta)
Type:
Enzyme
Mol. Mass.:
47356.76
Organism:
Homo sapiens (Human)
Description:
P48730
Residue:
415
  
Component 2
Name:
Casein kinase I isoform epsilon
Synonyms:
Axin-1/Casein kinase I epsilon CKIe Casein kinase 1 epsilon (CK1Ɛ) Casein kinase I isoform epsilon (CK1 epsilon) Casein kinase I isoform epsilon (CK1epsilon) | KC1E_HUMAN
Type:
Protein
Mol. Mass.:
47340.25
Organism:
Homo sapiens (Human)
Description:
P49674
Residue:
416
  
Inhibitor
Name:
BDBM100152
Synonyms:
7-methoxy-1-methyl-9H-beta-carboline;hydrochloride HARMINE MLS002153910 cid_5359389
Type:
Small organic molecule
Emp. Form.:
C13H12N2O
Mol. Mass.:
212.2472
SMILES:
COc1ccc2c(c1)[nH]c1c(C)nccc21
: