Target
Tyrosinase
Ligand
BDBM50205807
Substrate
Meas. Tech.
ChEMBL_1628554 (CHEMBL3871139)
Ki
350±n/a nM
Citation
 Haudecoeur, RCarotti, MGouron, AMaresca, MBuitrago, EHardré, RBergantino, EJamet, HBelle, CRéglier, MBubacco, LBoumendjel, A 2-Hydroxypyridine- ACS Med Chem Lett 8:55-60 (2017)  
Target
Name:
Tyrosinase
Synonyms:
LB24-AB SK29-AB TYRO_HUMAN | Tumor rejection antigen AB
Type:
Protein
Mol. Mass.:
60388.08
Organism:
Homo sapiens (Human)
Description:
P14679
Residue:
529
  
Inhibitor
Name:
BDBM50205807
Synonyms:
CHEMBL3978212
Type:
Small organic molecule
Emp. Form.:
C14H9NO5
Mol. Mass.:
271.225
SMILES:
Oc1ccc2C(=O)\C(Oc2c1)=C\c1ccc(=O)n(O)c1
: