Target
Kynurenine 3-monooxygenase
Ligand
BDBM50206615
Substrate
Meas. Tech.
ChEMBL_1629193 (CHEMBL3871819)
IC50
0.200000±n/a nM
Citation
 Amin, SAAdhikari, NJha, TGayen, S First molecular modeling report on novel arylpyrimidine kynurenine monooxygenase inhibitors through multi-QSAR analysis against Huntington's disease: A proposal to chemists! Bioorg Med Chem Lett 26:5712-5718 (2016)  
Target
Name:
Kynurenine 3-monooxygenase
Synonyms:
KMO | KMO_HUMAN
Type:
PROTEIN
Mol. Mass.:
55831.03
Organism:
Homo sapiens (Human)
Description:
ChEMBL_1487479
Residue:
486
  
Inhibitor
Name:
BDBM50206615
Synonyms:
CHEMBL3903832
Type:
Small organic molecule
Emp. Form.:
C11H6F2N2O2
Mol. Mass.:
236.1743
SMILES:
OC(=O)c1nccc(n1)-c1ccc(F)c(F)c1
: