Target
D(2) dopamine receptor
Ligand
BDBM50207036
Substrate
Meas. Tech.
ChEMBL_1629510 (CHEMBL3872136)
Ki
15849±n/a nM
Citation
 Saavedra, OMKarila, DBrossard, DRojas, ADupuis, DGohier, AMannoury la Cour, CMillan, MJOrtuno, JCHanessian, S Design and synthesis of novel N-sulfonyl-2-indoles that behave as 5-HT Bioorg Med Chem 25:38-52 (2017)  
Target
Name:
D(2) dopamine receptor
Synonyms:
D(2) dopamine receptor DOPAMINE D2 Long DRD2 Dopamine D2 receptor Dopamine D2 receptor (D2R) Dopamine2-like | d2
Type:
Cell-surface receptors
Mol. Mass.:
50647.10
Organism:
Homo sapiens (Human)
Description:
P14416
Residue:
443
  
Inhibitor
Name:
BDBM50207036
Synonyms:
CHEMBL3966484
Type:
Small organic molecule
Emp. Form.:
C19H20N2O3S
Mol. Mass.:
356.439
SMILES:
CN[C@@H]1[C@@H](CCO)c2ccc3n(ccc3c12)S(=O)(=O)c1ccccc1
: