Target
5-hydroxytryptamine receptor 6
Ligand
BDBM50207038
Substrate
Meas. Tech.
ChEMBL_1629512 (CHEMBL3872138)
Ki
1.000000±n/a nM
Citation
 Saavedra, OMKarila, DBrossard, DRojas, ADupuis, DGohier, AMannoury la Cour, CMillan, MJOrtuno, JCHanessian, S Design and synthesis of novel N-sulfonyl-2-indoles that behave as 5-HT Bioorg Med Chem 25:38-52 (2017)  
Target
Name:
5-hydroxytryptamine receptor 6
Synonyms:
5-HT-6 5-hydroxytryptamine receptor 6 (5-HT-6) 5-hydroxytryptamine receptor 6 (5HT6) HTR6 Serotonin 6 (5-HT6) receptor | Serotonin Receptor 6
Type:
G Protein-Coupled Receptor (GPCR)
Mol. Mass.:
46968.43
Organism:
Homo sapiens (Human)
Description:
P50406
Residue:
440
  
Inhibitor
Name:
BDBM50207038
Synonyms:
CHEMBL3961596
Type:
Small organic molecule
Emp. Form.:
C22H20N2O2S
Mol. Mass.:
376.471
SMILES:
CNCC1Cc2cc3ccn(c3cc12)S(=O)(=O)c1cccc2ccccc12
: