Target
Dual specificity protein kinase CLK1
Ligand
BDBM100152
Substrate
Meas. Tech.
ChEMBL_1633065 (CHEMBL3875857)
IC50
26±n/a nM
Citation
 Labrière, CLozach, OBlairvacq, MMeijer, LGuillou, C Further investigation of Paprotrain: Towards the conception of selective and multi-targeted CNS kinase inhibitors. Eur J Med Chem 124:920-934 (2016)  
Target
Name:
Dual specificity protein kinase CLK1
Synonyms:
CDC-like kinase 1 CDC2-like kinase 1 (CLK1) CLK1 Dual specificity protein kinase CLK1 Dual specificty protein kinase CLK1
Type:
Protein
Mol. Mass.:
57322.21
Organism:
Homo sapiens (Human)
Description:
P49759
Residue:
484
  
Inhibitor
Name:
BDBM100152
Synonyms:
7-methoxy-1-methyl-9H-beta-carboline;hydrochloride HARMINE MLS002153910 cid_5359389
Type:
Small organic molecule
Emp. Form.:
C13H12N2O
Mol. Mass.:
212.2472
SMILES:
COc1ccc2c(c1)[nH]c1c(C)nccc21
: