Target
Lysine-specific histone demethylase 1A
Ligand
BDBM50210049
Substrate
Meas. Tech.
ChEMBL_1634250 (CHEMBL3877042)
Ki
190000±n/a nM
Citation
 Amano, YUmezawa, NSato, SWatanabe, HUmehara, THiguchi, T Activation of lysine-specific demethylase 1 inhibitor peptide by redox-controlled cleavage of a traceless linker. Bioorg Med Chem 25:1227-1234 (2017)  
Target
Name:
Lysine-specific histone demethylase 1A
Synonyms:
AOF2 Flavin-containing amine oxidase domain-containing protein 2 KDM1A KIAA0601 Lysine-specific demethylase 1 (LSD1) Lysine-specific histone demethylase 1 (LSD1)
Type:
Enzyme
Mol. Mass.:
92901.01
Organism:
Homo sapiens (Human)
Description:
O60341
Residue:
852
  
Inhibitor
Name:
BDBM50210049
Synonyms:
CHEMBL3885101
Type:
Small organic molecule
Emp. Form.:
C61H103N19O15
Mol. Mass.:
1342.5888
SMILES:
CC(C)C[C@H](NC(=O)[C@H](Cc1ccccc1)NC(=O)[C@H](CO)NC(=O)[C@H](CCCNC(N)=N)NC(=O)[C@@H]1CCCN1C(=O)CO)C(=O)N[C@@H](C(C)C)C(=O)N[C@@H](CCCNC(N)=N)C(=O)N[C@@H](CCCCN)C(=O)N1CCC[C@H]1C(=O)N[C@@H](CCCCNC(=O)CO)C(N)=O
: