Target
Diacylglycerol lipase-alpha
Ligand
BDBM50211235
Substrate
Meas. Tech.
ChEBML_1636270
IC50
25±n/a nM
Citation
 Deng, HKooijman, Svan den Nieuwendijk, AMOgasawara, Dvan der Wel, Tvan Dalen, FBaggelaar, MPJanssen, FJvan den Berg, RJden Dulk, HCravatt, BFOverkleeft, HSRensen, PCvan der Stelt, M Triazole Ureas Act as Diacylglycerol Lipase Inhibitors and Prevent Fasting-Induced Refeeding. J Med Chem 60:428-440 (2017)  
Target
Name:
Diacylglycerol lipase-alpha
Synonyms:
C11orf11 DGLA_HUMAN NSDDR | Sn1-specific diacylglycerol lipase alpha
Type:
PROTEIN
Mol. Mass.:
114947.74
Organism:
Homo sapiens (Human)
Description:
ChEMBL_1449471
Residue:
1042
  
Inhibitor
Name:
BDBM50211235
Synonyms:
CHEMBL3974512
Type:
Small organic molecule
Emp. Form.:
C28H28N4O2
Mol. Mass.:
452.5475
SMILES:
OC(c1cn(nn1)C(=O)N1CCCCC1Cc1ccccc1)(c1ccccc1)c1ccccc1
: