Target
Diacylglycerol lipase-alpha
Ligand
BDBM50211277
Substrate
Meas. Tech.
ChEBML_1636270
IC50
5.0±n/a nM
Citation
 Deng, HKooijman, Svan den Nieuwendijk, AMOgasawara, Dvan der Wel, Tvan Dalen, FBaggelaar, MPJanssen, FJvan den Berg, RJden Dulk, HCravatt, BFOverkleeft, HSRensen, PCvan der Stelt, M Triazole Ureas Act as Diacylglycerol Lipase Inhibitors and Prevent Fasting-Induced Refeeding. J Med Chem 60:428-440 (2017)  
Target
Name:
Diacylglycerol lipase-alpha
Synonyms:
C11orf11 DGLA_HUMAN NSDDR | Sn1-specific diacylglycerol lipase alpha
Type:
PROTEIN
Mol. Mass.:
114947.74
Organism:
Homo sapiens (Human)
Description:
ChEMBL_1449471
Residue:
1042
  
Inhibitor
Name:
BDBM50211277
Synonyms:
CHEMBL3903742
Type:
Small organic molecule
Emp. Form.:
C29H28F2N4O3
Mol. Mass.:
518.5544
SMILES:
COc1ccc(CC2CCCCN2C(=O)n2ncc(n2)C(O)(c2ccc(F)cc2)c2ccc(F)cc2)cc1
: