Target
Beta-lactamase TEM
Ligand
BDBM50021959
Substrate
Meas. Tech.
ChEMBL_40709 (CHEMBL655783)
IC50
40.2±n/a nM
Citation
  TBA Bioorg Med Chem Lett 3:2247-2252 (1993)   
Target
Name:
Beta-lactamase TEM
Synonyms:
BLAT_ECOLX Beta-lactamase (TEM-1) Beta-lactamase TEM-1 Beta-lactamase TEM1D Beta-lactamase TEM1F TEM extended-spectrum beta-lactamase bla
Type:
Enzyme
Mol. Mass.:
31512.33
Organism:
Escherichia coli
Description:
P62593
Residue:
286
  
Inhibitor
Name:
BDBM50021959
Synonyms:
CHEMBL777 US9120808, Clavulanic acid potassium salt clavulanic acid
Type:
Small organic molecule
Emp. Form.:
C8H9NO5
Mol. Mass.:
199.1608
SMILES:
OC\C=C1/O[C@@H]2CC(=O)N2[C@H]1C(O)=O
: